Target
1-deoxy-D-xylulose 5-phosphate reductoisomerase
Ligand
BDBM50185360
Substrate
Meas. Tech.
ChEMBL_344886 (CHEMBL870710)
IC50
>30000±n/a nM
Citation
 Devreux, VWiesner, JGoeman, JLVan der Eycken, JJomaa, HVan Calenbergh, S Synthesis and biological evaluation of cyclopropyl analogues of fosmidomycin as potent Plasmodium falciparum growth inhibitors. J Med Chem 49:2656-60 (2006)  
Target
Name:
1-deoxy-D-xylulose 5-phosphate reductoisomerase
Synonyms:
1-Deoxy-D-xylulose 5-phosphate reductoisomerase (DXP) 1-deoxy-D-xylulose 5-phosphate reductoisomerase (DXR) DXP reductoisomerase dxr yaeM
Type:
Protein
Mol. Mass.:
43384.52
Organism:
Escherichia coli
Description:
P45568
Residue:
398
  
Inhibitor
Name:
BDBM50185360
Synonyms:
2-[N-(acetyl),N-(hydroxy)aminomethyl]-1-phenylcyclopropylphosphonic acid | CHEMBL382795
Type:
Small organic molecule
Emp. Form.:
C12H16NO5P
Mol. Mass.:
285.2329
SMILES:
CC(=O)N(O)CC1CC1(c1ccccc1)P(O)(O)=O
: