Target
Trypanothione reductase
Ligand
BDBM50185400
Substrate
Meas. Tech.
ChEMBL_360714 (CHEMBL869331)
IC50
2960±n/a nM
Citation
 Bi, XLopez, CBacchi, CJRattendi, DWoster, PM Novel alkylpolyaminoguanidines and alkylpolyaminobiguanides with potent antitrypanosomal activity. Bioorg Med Chem Lett 16:3229-32 (2006)  
Target
Name:
Trypanothione reductase
Synonyms:
N(1),N(8)-bis(glutathionyl)spermidine reductase TR | TYTR_TRYCR
Type:
Homodimer; oxidoreductase
Mol. Mass.:
53868.26
Organism:
Trypanosoma cruzi
Description:
Residue:
492
  
Inhibitor
Name:
BDBM50185400
Synonyms:
CHEMBL378136 | N-(3,3-diphenylpropyl)-1-3-[3-({4-[(3-{N-[3-(3,3-diphenylpropyl)carbamimidamidomethanimidoyl]amino}propyl)amino]butyl}amino)propyl]carbamimidamidomethanimidamide
Type:
Small organic molecule
Emp. Form.:
C44H62N12
Mol. Mass.:
759.0435
SMILES:
NC(NC(=N)NCCC(c1ccccc1)c1ccccc1)=NCCCNCCCCNCCCN=C(N)NC(=N)NCCC(c1ccccc1)c1ccccc1
: