Target
5-hydroxytryptamine receptor 2A
Ligand
BDBM50185473
Substrate
Meas. Tech.
ChEMBL_361005 (CHEMBL862618)
Ki
31±n/a nM
Citation
 Ablordeppey, SYLyles-Eggleston, MBricker, BZhang, WZhu, XGoodman, CRoth, BL Evaluation of the eutomer of 4-{3-(4-chlorophenyl)-3-hydroxypyrrolidin-1-yl}-1-(4-fluorophenyl)butan-1-one, {(+)-SYA 09}, a pyrrolidine analog of haloperidol. Bioorg Med Chem Lett 16:3219-23 (2006)  
Target
Name:
5-hydroxytryptamine receptor 2A
Synonyms:
5-HT-2 5-HT2A 5-hydroxytryptamine receptor 2A (5HT-2A) 5HT2A_HUMAN HTR2A | Serotonin receptor 2A
Type:
undefined
Mol. Mass.:
52607.65
Organism:
Homo sapiens (Human)
Description:
P28223
Residue:
471
  
Inhibitor
Name:
BDBM50185473
Synonyms:
4-(3-(4-chlorophenyl)-3-hydroxy-8-aza-bicyclo[3.2.1]octan-8-yl)-1-(4-fluorophenyl)butan-1-one 4-[3-(4-Chlorophenyl)-3-hydroxy-8-azabicyclo[3.2.1]oct-8-yl]-1-(4-fluorophenyl)butan-1-one | CHEMBL210578
Type:
Small organic molecule
Emp. Form.:
C23H25ClFNO2
Mol. Mass.:
401.902
SMILES:
OC1(CC2CCC(C1)N2CCCC(=O)c1ccc(F)cc1)c1ccc(Cl)cc1
: