Target
Inosine-5'-monophosphate dehydrogenase 2
Ligand
BDBM50185598
Substrate
Meas. Tech.
ChEMBL_371821 (CHEMBL865552)
IC50
498±n/a nM
Citation
 Watkins, WJChen, JMCho, AChong, LCollins, NFardis, MHuang, WHung, MKirschberg, TLee, WALiu, XThomas, WXu, JZeynalzadegan, AZhang, J Phosphonic acid-containing analogues of mycophenolic acid as inhibitors of IMPDH. Bioorg Med Chem Lett 16:3479-83 (2006)  
Target
Name:
Inosine-5'-monophosphate dehydrogenase 2
Synonyms:
IMDH2_HUMAN IMPD 2 IMPDH-II Inosine 5'-monophosphate dehydrogenase II (IMPDH II) Inosine-5 -monophosphate dehydrogenase 2 | Inosine-5'-monophosphate dehydrogenase (IMPDH)
Type:
Enzyme
Mol. Mass.:
55806.87
Organism:
Homo sapiens (Human)
Description:
Recombinant IMPDH2 expressed in E. coli.
Residue:
514
  
Inhibitor
Name:
BDBM50185598
Synonyms:
(2-{[(E)-4-(4-Hydroxy-6-methoxy-7-methyl-3-oxo-1,3-dihydro-isobenzofuran-5-yl)-2-methyl-but-2-enyl]-methanesulfonyl-amino}-ethyl)-phosphonic acid | CHEMBL212199
Type:
Small organic molecule
Emp. Form.:
C18H26NO9PS
Mol. Mass.:
463.439
SMILES:
COc1c(C)c2COC(=O)c2c(O)c1C\C=C(/C)CN(CCP(O)(O)=O)S(C)(=O)=O
: