Target
Inosine-5'-monophosphate dehydrogenase 2
Ligand
BDBM50185599
Substrate
Meas. Tech.
ChEMBL_371821 (CHEMBL865552)
IC50
246±n/a nM
Citation
 Watkins, WJChen, JMCho, AChong, LCollins, NFardis, MHuang, WHung, MKirschberg, TLee, WALiu, XThomas, WXu, JZeynalzadegan, AZhang, J Phosphonic acid-containing analogues of mycophenolic acid as inhibitors of IMPDH. Bioorg Med Chem Lett 16:3479-83 (2006)  
Target
Name:
Inosine-5'-monophosphate dehydrogenase 2
Synonyms:
IMDH2_HUMAN IMPD 2 IMPDH-II Inosine 5'-monophosphate dehydrogenase II (IMPDH II) Inosine-5 -monophosphate dehydrogenase 2 | Inosine-5'-monophosphate dehydrogenase (IMPDH)
Type:
Enzyme
Mol. Mass.:
55806.87
Organism:
Homo sapiens (Human)
Description:
Recombinant IMPDH2 expressed in E. coli.
Residue:
514
  
Inhibitor
Name:
BDBM50185599
Synonyms:
(E)-(4-(4-hydroxy-6-methoxy-7-methyl-3-oxo-1,3-dihydroisobenzofuran-5-yl)-2-methylbut-2-enyloxy)methylphosphonic acid | CHEMBL378089
Type:
Small organic molecule
Emp. Form.:
C16H21O8P
Mol. Mass.:
372.3069
SMILES:
COc1c(C)c2COC(=O)c2c(O)c1C\C=C(/C)COCP(O)(O)=O
: