Target
5-hydroxytryptamine receptor 2C
Ligand
BDBM50185773
Substrate
Meas. Tech.
ChEMBL_361714 (CHEMBL861445)
Ki
997±n/a nM
Citation
 Ladduwahetty, TBoase, ALMitchinson, AQuin, CPatel, SChapman, KMacLeod, AM A new class of selective, non-basic 5-HT2A receptor antagonists. Bioorg Med Chem Lett 16:3201-4 (2006)  
Target
Name:
5-hydroxytryptamine receptor 2C
Synonyms:
5-HT-2C 5-HT2C-INI 5-HTR2C 5-hydroxytryptamine receptor 2C (5-HT-2C) 5HT-1C HTR1C Serotonin (5-HT3) receptor Serotonin Receptor 2C
Type:
G Protein-Coupled Receptor (GPCR)
Mol. Mass.:
51836.79
Organism:
Homo sapiens (Human)
Description:
P28335
Residue:
458
  
Inhibitor
Name:
BDBM50185773
Synonyms:
4-(2,4-difluorophenethyl)-1-(3-fluorophenylsulfonyl)piperidine | CHEMBL383530
Type:
Small organic molecule
Emp. Form.:
C19H20F3NO2S
Mol. Mass.:
383.428
SMILES:
Fc1cccc(c1)S(=O)(=O)N1CCC(CCc2ccc(F)cc2F)CC1
: