Target
D(2) dopamine receptor
Ligand
BDBM50185780
Substrate
Meas. Tech.
ChEMBL_361716 (CHEMBL861448)
Ki
>1000±n/a nM
Citation
 Ladduwahetty, TBoase, ALMitchinson, AQuin, CPatel, SChapman, KMacLeod, AM A new class of selective, non-basic 5-HT2A receptor antagonists. Bioorg Med Chem Lett 16:3201-4 (2006)  
Target
Name:
D(2) dopamine receptor
Synonyms:
D(2) dopamine receptor DOPAMINE D2 Long DRD2 Dopamine D2 receptor Dopamine D2 receptor (D2R) Dopamine2-like | d2
Type:
Cell-surface receptors
Mol. Mass.:
50647.10
Organism:
Homo sapiens (Human)
Description:
P14416
Residue:
443
  
Inhibitor
Name:
BDBM50185780
Synonyms:
(4-(2,4-difluorophenethyl)piperidin-1-yl)(2-fluorophenyl)methanone | CHEMBL210230
Type:
Small organic molecule
Emp. Form.:
C20H20F3NO
Mol. Mass.:
347.3741
SMILES:
Fc1ccc(CCC2CCN(CC2)C(=O)c2ccccc2F)c(F)c1
: