Target
Estrogen receptor beta
Ligand
BDBM50185852
Substrate
Meas. Tech.
ChEMBL_371968 (CHEMBL852961)
IC50
32±n/a nM
Citation
 Wilkening, RRRatcliffe, RWTynebor, ECWildonger, KJFried, AKHammond, MLMosley, RTFitzgerald, PMSharma, NMcKeever, BMNilsson, SCarlquist, MThorsell, ALocco, LKatz, RFrisch, KBirzin, ETWilkinson, HAMitra, SCai, SHayes, ECSchaeffer, JMRohrer, SP The discovery of tetrahydrofluorenones as a new class of estrogen receptor beta-subtype selective ligands. Bioorg Med Chem Lett 16:3489-94 (2006)  
Target
Name:
Estrogen receptor beta
Synonyms:
ER-beta ESR2_HUMAN Estradiol receptor beta (ERβ) Estrogen receptor (ER beta) Estrogen receptor beta (ER beta) NR3A2 estrogen beta
Type:
Protein
Mol. Mass.:
59238.43
Organism:
Homo sapiens (Human)
Description:
Q92731
Residue:
530
  
Inhibitor
Name:
BDBM50185852
Synonyms:
7-hydroxy-3-oxo-9a-phenyl-2,3,9,9a-tetrahydro-1H-fluorene-4-carbonitrile | CHEMBL211739
Type:
Small organic molecule
Emp. Form.:
C20H15NO2
Mol. Mass.:
301.3386
SMILES:
Oc1ccc2C3=C(C#N)C(=O)CCC3(Cc2c1)c1ccccc1
: