Target
C-C chemokine receptor type 5
Ligand
BDBM50185960
Substrate
Meas. Tech.
ChEMBL_351942 (CHEMBL870788)
IC50
16±n/a nM
Citation
 Imamura, SIchikawa, TNishikawa, YKanzaki, NTakashima, KNiwa, SIizawa, YBaba, MSugihara, Y Discovery of a piperidine-4-carboxamide CCR5 antagonist (TAK-220) with highly potent Anti-HIV-1 activity. J Med Chem 49:2784-93 (2006)  
Target
Name:
C-C chemokine receptor type 5
Synonyms:
C-C CKR-5 CC-CKR-5 CCR5 CCR5_HUMAN CHEMR13 HIV-1 fusion coreceptor
Type:
Enzyme
Mol. Mass.:
40540.21
Organism:
Homo sapiens (Human)
Description:
P51681
Residue:
352
  
Inhibitor
Name:
BDBM50185960
Synonyms:
1-acetyl-N-(3-(4-benzylpiperidin-1-yl)propyl)-N-phenylpiperidine-4-carboxamide | CHEMBL207085
Type:
Small organic molecule
Emp. Form.:
C29H39N3O2
Mol. Mass.:
461.6389
SMILES:
CC(=O)N1CCC(CC1)C(=O)N(CCCN1CCC(Cc2ccccc2)CC1)c1ccccc1
: