Target
C-C chemokine receptor type 5
Ligand
BDBM50185977
Substrate
Meas. Tech.
ChEMBL_351942 (CHEMBL870788)
IC50
66±n/a nM
Citation
 Imamura, SIchikawa, TNishikawa, YKanzaki, NTakashima, KNiwa, SIizawa, YBaba, MSugihara, Y Discovery of a piperidine-4-carboxamide CCR5 antagonist (TAK-220) with highly potent Anti-HIV-1 activity. J Med Chem 49:2784-93 (2006)  
Target
Name:
C-C chemokine receptor type 5
Synonyms:
C-C CKR-5 CC-CKR-5 CCR5 CCR5_HUMAN CHEMR13 HIV-1 fusion coreceptor
Type:
Enzyme
Mol. Mass.:
40540.21
Organism:
Homo sapiens (Human)
Description:
P51681
Residue:
352
  
Inhibitor
Name:
BDBM50185977
Synonyms:
4-({1-[3-((3,4-dichlorophenyl){[1-(methylsulfonyl)piperidin-4-yl]carbonyl}amino)propyl]piperidin-4-yl}methyl)benzoic acid | CHEMBL207633
Type:
Small organic molecule
Emp. Form.:
C29H37Cl2N3O5S
Mol. Mass.:
610.592
SMILES:
CS(=O)(=O)N1CCC(CC1)C(=O)N(CCCN1CCC(Cc2ccc(cc2)C(O)=O)CC1)c1ccc(Cl)c(Cl)c1
: