Target
C-C chemokine receptor type 5
Ligand
BDBM50185965
Substrate
Meas. Tech.
ChEMBL_351943 (CHEMBL870789)
IC50
26±n/a nM
Citation
 Imamura, SIchikawa, TNishikawa, YKanzaki, NTakashima, KNiwa, SIizawa, YBaba, MSugihara, Y Discovery of a piperidine-4-carboxamide CCR5 antagonist (TAK-220) with highly potent Anti-HIV-1 activity. J Med Chem 49:2784-93 (2006)  
Target
Name:
C-C chemokine receptor type 5
Synonyms:
C-C CKR-5 CC-CKR-5 CCR5 CCR5_HUMAN CHEMR13 HIV-1 fusion coreceptor
Type:
Enzyme
Mol. Mass.:
40540.21
Organism:
Homo sapiens (Human)
Description:
P51681
Residue:
352
  
Inhibitor
Name:
BDBM50185965
Synonyms:
1-acetyl-N-(3,4-dichlorophenyl)-N-{3-[4-(4-fluoroanilino)piperidin-1-yl]propyl}piperidine-4-carboxamide | CHEMBL205851
Type:
Small organic molecule
Emp. Form.:
C28H35Cl2FN4O2
Mol. Mass.:
549.508
SMILES:
CC(=O)N1CCC(CC1)C(=O)N(CCCN1CCC(CC1)Nc1ccc(F)cc1)c1ccc(Cl)c(Cl)c1
: