Target
Histamine H3 receptor
Ligand
BDBM50186295
Substrate
Meas. Tech.
ChEMBL_370710 (CHEMBL867233)
Ki
2.9±n/a nM
Citation
 Jesudason, CDBeavers, LSCramer, JWDill, JFinley, DRLindsley, CWStevens, FCGadski, RAOldham, SWPickard, RTSiedem, CSSindelar, DKSingh, AWatson, BMHipskind, PA Synthesis and SAR of novel histamine H3 receptor antagonists. Bioorg Med Chem Lett 16:3415-8 (2006)  
Target
Name:
Histamine H3 receptor
Synonyms:
G-protein coupled receptor 97 HH3R HRH3 Histamine H3 receptor (H3) Histamine receptor (H3 and H4)
Type:
G Protein-Coupled Receptor (GPCR)
Mol. Mass.:
48691.47
Organism:
Homo sapiens (Human)
Description:
Binding assays were using CHO cells stably expressing hH3R receptors.
Residue:
445
  
Inhibitor
Name:
BDBM50186295
Synonyms:
2-(methylsulfonyl)-7-(3-(piperidin-1-yl)propoxy)-2,3,4,5-tetrahydro-1H-benzo[c]azepine | CHEMBL207062
Type:
Small organic molecule
Emp. Form.:
C19H30N2O3S
Mol. Mass.:
366.518
SMILES:
CS(=O)(=O)N1CCCc2cc(OCCCN3CCCCC3)ccc2C1
: