Target
Histamine H3 receptor
Ligand
BDBM50186291
Substrate
Meas. Tech.
ChEMBL_370710 (CHEMBL867233)
Ki
0.17±n/a nM
Citation
 Jesudason, CDBeavers, LSCramer, JWDill, JFinley, DRLindsley, CWStevens, FCGadski, RAOldham, SWPickard, RTSiedem, CSSindelar, DKSingh, AWatson, BMHipskind, PA Synthesis and SAR of novel histamine H3 receptor antagonists. Bioorg Med Chem Lett 16:3415-8 (2006)  
Target
Name:
Histamine H3 receptor
Synonyms:
G-protein coupled receptor 97 HH3R HRH3 Histamine H3 receptor (H3) Histamine receptor (H3 and H4)
Type:
G Protein-Coupled Receptor (GPCR)
Mol. Mass.:
48691.47
Organism:
Homo sapiens (Human)
Description:
Binding assays were using CHO cells stably expressing hH3R receptors.
Residue:
445
  
Inhibitor
Name:
BDBM50186291
Synonyms:
2-isopropyl-7-(3-(piperidin-1-yl)propoxy)-1,2,3,4-tetrahydroisoquinoline | CHEMBL208650
Type:
Small organic molecule
Emp. Form.:
C20H32N2O
Mol. Mass.:
316.4809
SMILES:
CC(C)N1CCc2ccc(OCCCN3CCCCC3)cc2C1
: