Target
Histamine H3 receptor
Ligand
BDBM50186310
Substrate
Meas. Tech.
ChEMBL_370710 (CHEMBL867233)
Ki
>300±n/a nM
Citation
 Jesudason, CDBeavers, LSCramer, JWDill, JFinley, DRLindsley, CWStevens, FCGadski, RAOldham, SWPickard, RTSiedem, CSSindelar, DKSingh, AWatson, BMHipskind, PA Synthesis and SAR of novel histamine H3 receptor antagonists. Bioorg Med Chem Lett 16:3415-8 (2006)  
Target
Name:
Histamine H3 receptor
Synonyms:
G-protein coupled receptor 97 HH3R HRH3 Histamine H3 receptor (H3) Histamine receptor (H3 and H4)
Type:
G Protein-Coupled Receptor (GPCR)
Mol. Mass.:
48691.47
Organism:
Homo sapiens (Human)
Description:
Binding assays were using CHO cells stably expressing hH3R receptors.
Residue:
445
  
Inhibitor
Name:
BDBM50186310
Synonyms:
(5-(3-(piperidin-1-yl)propoxy)-3,4-dihydroisoquinolin-2(1H)-yl)(thiophen-2-yl)methanone | CHEMBL209362
Type:
Small organic molecule
Emp. Form.:
C22H28N2O2S
Mol. Mass.:
384.535
SMILES:
O=C(N1CCc2c(C1)cccc2OCCCN1CCCCC1)c1cccs1
: