Target
Proteasome subunit beta type-5
Ligand
BDBM50186712
Substrate
Meas. Tech.
ChEMBL_353294 (CHEMBL861973)
IC50
2.9±n/a nM
Citation
 Rydzewski, RMBurrill, LMendonca, RPalmer, JTRice, MTahilramani, RBass, KELeung, LGjerstad, EJanc, JWPan, L Optimization of subsite binding to the beta5 subunit of the human 20S proteasome using vinyl sulfones and 2-keto-1,3,4-oxadiazoles: syntheses and cellular properties of potent, selective proteasome inhibitors. J Med Chem 49:2953-68 (2006)  
Target
Name:
Proteasome subunit beta type-5
Synonyms:
20S proteasome chymotrypsin-like LMPX PSB5_HUMAN Proteasome Macropain subunit MB1 X
Type:
Protein
Mol. Mass.:
28480.96
Organism:
Homo sapiens (Human)
Description:
Residue:
263
  
Inhibitor
Name:
BDBM50186712
Synonyms:
CHEMBL206206 | Cbz-Glu(OtBu)-Ser-LeuVSMe
Type:
Small organic molecule
Emp. Form.:
C28H43N3O9S
Mol. Mass.:
597.721
SMILES:
CC(C)C[C@H](NC(=O)[C@H](CO)NC(=O)[C@H](CCC(=O)OC(C)(C)C)NC(=O)OCc1ccccc1)C=CS(C)(=O)=O
: