Target
Proteasome subunit beta type-5
Ligand
BDBM50410896
Substrate
Meas. Tech.
ChEMBL_353294 (CHEMBL861973)
Ki
38±n/a nM
Citation
 Rydzewski, RMBurrill, LMendonca, RPalmer, JTRice, MTahilramani, RBass, KELeung, LGjerstad, EJanc, JWPan, L Optimization of subsite binding to the beta5 subunit of the human 20S proteasome using vinyl sulfones and 2-keto-1,3,4-oxadiazoles: syntheses and cellular properties of potent, selective proteasome inhibitors. J Med Chem 49:2953-68 (2006)  
Target
Name:
Proteasome subunit beta type-5
Synonyms:
20S proteasome chymotrypsin-like LMPX PSB5_HUMAN Proteasome Macropain subunit MB1 X
Type:
Protein
Mol. Mass.:
28480.96
Organism:
Homo sapiens (Human)
Description:
Residue:
263
  
Inhibitor
Name:
BDBM50410896
Synonyms:
CHEMBL383122
Type:
Small organic molecule
Emp. Form.:
C25H45N7O7S
Mol. Mass.:
587.733
SMILES:
CC(C)C[C@H](NC(=O)[C@H](C)NC(=O)[C@H](CC(=O)NCC(C)(C)C)NS(=O)(=O)N(C)C)C(=O)c1nnc(o1)C(C)C
: