Target
Proteasome subunit beta type-1
Ligand
BDBM50069984
Substrate
Meas. Tech.
ChEMBL_353296 (CHEMBL861975)
Ki
48000±n/a nM
Citation
 Rydzewski, RMBurrill, LMendonca, RPalmer, JTRice, MTahilramani, RBass, KELeung, LGjerstad, EJanc, JWPan, L Optimization of subsite binding to the beta5 subunit of the human 20S proteasome using vinyl sulfones and 2-keto-1,3,4-oxadiazoles: syntheses and cellular properties of potent, selective proteasome inhibitors. J Med Chem 49:2953-68 (2006)  
Target
Name:
Proteasome subunit beta type-1
Synonyms:
PSB1_HUMAN PSMB1 Proteasome subunit beta type-1/beta type-5
Type:
PROTEIN
Mol. Mass.:
26493.62
Organism:
Homo sapiens (Human)
Description:
ChEMBL_1366691
Residue:
241
  
Inhibitor
Name:
BDBM50069984
Synonyms:
(R)-1-((S)-2-((S)-2-(benzyloxycarbonyl)-4-methylpentanamido)-4-methylpentanamido)-3-methylbutylboronic acid Dipeptidyl boronic acid derivative
Type:
Small organic molecule
Emp. Form.:
C25H42BN3O6
Mol. Mass.:
491.428
SMILES:
CC(C)C[C@H](NC(=O)[C@H](CC(C)C)NC(=O)[C@H](CC(C)C)NC(=O)OCc1ccccc1)B(O)O
: