Target
Sphingosine 1-phosphate receptor 2
Ligand
BDBM50186930
Substrate
Meas. Tech.
ChEMBL_376407 (CHEMBL866633)
EC50
>10000±n/a nM
Citation
 Yan, LHuo, PDoherty, GToth, LHale, JJMills, SGHajdu, RKeohane, CARosenbach, MJMilligan, JAShei, GJChrebet, GBergstrom, JCard, DQuackenbush, EWickham, AMandala, SM Discovery of 3-arylpropionic acids as potent agonists of sphingosine-1-phosphate receptor-1 (S1P1) with high selectivity against all other known S1P receptor subtypes. Bioorg Med Chem Lett 16:3679-83 (2006)  
Target
Name:
Sphingosine 1-phosphate receptor 2
Synonyms:
EDG5 S1PR2 Sphingosine 1-phosphate receptor Sphingosine-1-phosphate receptor 2 | ndothelial differentiation G-protein coupled receptor 5
Type:
G Protein-Coupled Receptor (GPCR)
Mol. Mass.:
38883.16
Organism:
Homo sapiens (Human)
Description:
Membranes isolated from S1P2-transfected CHO cells were used in ligand binding assay.
Residue:
353
  
Inhibitor
Name:
BDBM50186930
Synonyms:
4-(4-(5-(4-cyclohexylphenyl)-1,2,4-oxadiazol-3-yl)-3-methylphenyl)butanoic acid | CHEMBL208224
Type:
Small organic molecule
Emp. Form.:
C25H28N2O3
Mol. Mass.:
404.5014
SMILES:
Cc1cc(CCCC(O)=O)ccc1-c1noc(n1)-c1ccc(cc1)C1CCCCC1
: