Target
Sphingosine 1-phosphate receptor 1
Ligand
BDBM50186934
Substrate
Meas. Tech.
ChEMBL_376406 (CHEMBL866632)
EC50
0.11±n/a nM
Citation
 Yan, LHuo, PDoherty, GToth, LHale, JJMills, SGHajdu, RKeohane, CARosenbach, MJMilligan, JAShei, GJChrebet, GBergstrom, JCard, DQuackenbush, EWickham, AMandala, SM Discovery of 3-arylpropionic acids as potent agonists of sphingosine-1-phosphate receptor-1 (S1P1) with high selectivity against all other known S1P receptor subtypes. Bioorg Med Chem Lett 16:3679-83 (2006)  
Target
Name:
Sphingosine 1-phosphate receptor 1
Synonyms:
CHEDG1 Endothelial differentiation G-protein coupled receptor 1 S1P1 S1PR1_HUMAN Sphingosine 1-phosphate receptor Edg-1
Type:
Enzyme
Mol. Mass.:
42836.02
Organism:
Homo sapiens (Human)
Description:
P21453
Residue:
382
  
Inhibitor
Name:
BDBM50186934
Synonyms:
3-(4-(5-(3-cyano-4-(2,2,2-trifluoroethoxy)phenyl)-1,2,4-oxadiazol-3-yl)-3-methylphenyl)propanoic acid | CHEMBL379380
Type:
Small organic molecule
Emp. Form.:
C21H16F3N3O4
Mol. Mass.:
431.3646
SMILES:
Cc1cc(CCC(O)=O)ccc1-c1noc(n1)-c1ccc(OCC(F)(F)F)c(c1)C#N
: