Target
Sphingosine 1-phosphate receptor 5
Ligand
BDBM50186927
Substrate
Meas. Tech.
ChEMBL_376410 (CHEMBL866638)
EC50
266±n/a nM
Citation
 Yan, LHuo, PDoherty, GToth, LHale, JJMills, SGHajdu, RKeohane, CARosenbach, MJMilligan, JAShei, GJChrebet, GBergstrom, JCard, DQuackenbush, EWickham, AMandala, SM Discovery of 3-arylpropionic acids as potent agonists of sphingosine-1-phosphate receptor-1 (S1P1) with high selectivity against all other known S1P receptor subtypes. Bioorg Med Chem Lett 16:3679-83 (2006)  
Target
Name:
Sphingosine 1-phosphate receptor 5
Synonyms:
EDG8 S1P5 S1PR5_HUMAN Sphingosine 1-phosphate receptor Edg-8
Type:
G Protein-Coupled Receptor (GPCR)
Mol. Mass.:
41796.42
Organism:
Homo sapiens (Human)
Description:
Residue:
398
  
Inhibitor
Name:
BDBM50186927
Synonyms:
5-(4-cyclohexylphenyl)-3-o-tolyl-1,2,4-oxadiazole | CHEMBL208786
Type:
Small organic molecule
Emp. Form.:
C21H22N2O
Mol. Mass.:
318.4122
SMILES:
Cc1ccccc1-c1noc(n1)-c1ccc(cc1)C1CCCCC1
: