Target
Sphingosine 1-phosphate receptor 5
Ligand
BDBM50186918
Substrate
Meas. Tech.
ChEMBL_376410 (CHEMBL866638)
EC50
15±n/a nM
Citation
 Yan, LHuo, PDoherty, GToth, LHale, JJMills, SGHajdu, RKeohane, CARosenbach, MJMilligan, JAShei, GJChrebet, GBergstrom, JCard, DQuackenbush, EWickham, AMandala, SM Discovery of 3-arylpropionic acids as potent agonists of sphingosine-1-phosphate receptor-1 (S1P1) with high selectivity against all other known S1P receptor subtypes. Bioorg Med Chem Lett 16:3679-83 (2006)  
Target
Name:
Sphingosine 1-phosphate receptor 5
Synonyms:
EDG8 S1P5 S1PR5_HUMAN Sphingosine 1-phosphate receptor Edg-8
Type:
G Protein-Coupled Receptor (GPCR)
Mol. Mass.:
41796.42
Organism:
Homo sapiens (Human)
Description:
Residue:
398
  
Inhibitor
Name:
BDBM50186918
Synonyms:
3-(4-(5-(4-(S)-sec-butoxy-3-cyanophenyl)-1,2,4-oxadiazol-3-yl)-3-methylphenyl)propanoic acid | CHEMBL378054
Type:
Small organic molecule
Emp. Form.:
C23H23N3O4
Mol. Mass.:
405.4464
SMILES:
CC[C@H](C)Oc1ccc(cc1C#N)-c1nc(no1)-c1ccc(CCC(O)=O)cc1C
: