Target
Coagulation factor VII
Ligand
BDBM14312
Substrate
Meas. Tech.
ChEMBL_387237 (CHEMBL864206)
Ki
>150000±n/a nM
Citation
 Lee, CSLiu, WSprengeler, PASomoza, JRJanc, JWSperandio, DSpencer, JRGreen, MJMcGrath, ME Design of novel, potent, and selective human beta-tryptase inhibitors based on alpha-keto-[1,2,4]-oxadiazoles. Bioorg Med Chem Lett 16:4036-40 (2006)  
Target
Name:
Coagulation factor VII
Synonyms:
Eptacog alfa FA7_HUMAN Factor VIIa (fVIIa) SPCA serum prothrombin conversion accelerator
Type:
Enzyme
Mol. Mass.:
51599.89
Organism:
Homo sapiens (Human)
Description:
Residue:
466
  
Inhibitor
Name:
BDBM14312
Synonyms:
CHEMBL214368 ethyl N-[(2S)-6-amino-1-(5-{[4-(2,3-dihydro-1H-inden-2-ylcarbamoyl)phenyl]methyl}-1,2,4-oxadiazol-3-yl)-1-oxohexan-2-yl]carbamate
Type:
Small organic molecule
Emp. Form.:
C28H33N5O5
Mol. Mass.:
519.5921
SMILES:
CCOC(=O)N[C@@H](CCCCN)C(=O)c1noc(Cc2ccc(cc2)C(=O)NC2Cc3ccccc3C2)n1
: