Target
Dipeptidyl peptidase 2
Ligand
BDBM50187266
Substrate
Meas. Tech.
ChEMBL_357373 (CHEMBL854258)
IC50
>30000±n/a nM
Citation
 Wright, SWAmmirati, MJAndrews, KMBrodeur, AMDanley, DEDoran, SDLillquist, JSMcClure, LDMcPherson, RKOrena, SJParker, JCPolivkova, JQiu, XSoeller, WCSoglia, CBTreadway, JLVanVolkenburg, MAWang, HWilder, DCOlson, TV cis-2,5-dicyanopyrrolidine inhibitors of dipeptidyl peptidase IV: synthesis and in vitro, in vivo, and X-ray crystallographic characterization. J Med Chem 49:3068-76 (2006)  
Target
Name:
Dipeptidyl peptidase 2
Synonyms:
DAP II DPP2_HUMAN Dipeptidyl aminopeptidase II Dipeptidyl peptidase 2 (DPP2) Dipeptidyl peptidase II (DPP II) Dipeptidyl peptidase II and dipeptidyl peptidase IV (DPP2 and DPP4) carboxytripeptidase dipeptidyl(amino)peptidase II | dipeptidylarylamidase
Type:
Protein
Mol. Mass.:
54339.29
Organism:
Homo sapiens (Human)
Description:
Q9UHL4
Residue:
492
  
Inhibitor
Name:
BDBM50187266
Synonyms:
(2R,5S)-1-(2-(1-(hydroxymethyl)cyclopentylamino)acetyl)pyrrolidine-2,5-dicarbonitrile | CHEMBL379522
Type:
Small organic molecule
Emp. Form.:
C14H20N4O2
Mol. Mass.:
276.3342
SMILES:
OCC1(CCCC1)NCC(=O)N1[C@@H](CC[C@@H]1C#N)C#N
: