Target
Dipeptidyl peptidase 8
Ligand
BDBM50187283
Substrate
Meas. Tech.
ChEMBL_357375 (CHEMBL854260)
IC50
>30000±n/a nM
Citation
 Wright, SWAmmirati, MJAndrews, KMBrodeur, AMDanley, DEDoran, SDLillquist, JSMcClure, LDMcPherson, RKOrena, SJParker, JCPolivkova, JQiu, XSoeller, WCSoglia, CBTreadway, JLVanVolkenburg, MAWang, HWilder, DCOlson, TV cis-2,5-dicyanopyrrolidine inhibitors of dipeptidyl peptidase IV: synthesis and in vitro, in vivo, and X-ray crystallographic characterization. J Med Chem 49:3068-76 (2006)  
Target
Name:
Dipeptidyl peptidase 8
Synonyms:
DPP8 DPRP-1 Dipeptidyl peptidase 8 (DPP-8) Dipeptidyl peptidase 8/9 Dipeptidyl peptidase VIII Prolyl dipeptidase DPP8
Type:
Enzyme
Mol. Mass.:
103342.62
Organism:
Homo sapiens (Human)
Description:
Q6V1X1
Residue:
898
  
Inhibitor
Name:
BDBM50187283
Synonyms:
(2R,5S)-1-(2-(1-(ethoxymethyl)cyclopentylamino)acetyl)pyrrolidine-2,5-dicarbonitrile | CHEMBL209191
Type:
Small organic molecule
Emp. Form.:
C16H24N4O2
Mol. Mass.:
304.3874
SMILES:
CCOCC1(CCCC1)NCC(=O)N1[C@@H](CC[C@@H]1C#N)C#N
: