Target
Dipeptidyl peptidase 4
Ligand
BDBM50187303
Substrate
Meas. Tech.
ChEMBL_357329 (CHEMBL867558)
IC50
771±n/a nM
Citation
 Wright, SWAmmirati, MJAndrews, KMBrodeur, AMDanley, DEDoran, SDLillquist, JSMcClure, LDMcPherson, RKOrena, SJParker, JCPolivkova, JQiu, XSoeller, WCSoglia, CBTreadway, JLVanVolkenburg, MAWang, HWilder, DCOlson, TV cis-2,5-dicyanopyrrolidine inhibitors of dipeptidyl peptidase IV: synthesis and in vitro, in vivo, and X-ray crystallographic characterization. J Med Chem 49:3068-76 (2006)  
Target
Name:
Dipeptidyl peptidase 4
Synonyms:
ADABP Adenosine deaminase complexing protein 2 CD_antigen=CD26 DPP4 DPPIV Dipeptidyl peptidase 4 (DPP IV) Dipeptidyl peptidase 4 (DPP4) Dipeptidyl peptidase 4 membrane form Dipeptidyl peptidase IV Dipeptidyl peptidase IV (DDP-IV) Dipeptidyl peptidase IV membrane form Dipeptidyl peptidase-IV (DPP-4) T-cell activation antigen CD26 | TP103
Type:
Enzyme
Mol. Mass.:
88271.01
Organism:
Homo sapiens (Human)
Description:
P27487
Residue:
766
  
Inhibitor
Name:
BDBM50187303
Synonyms:
(2R,5S)-1-(2-(1,3-dimethylcyclopentylamino)acetyl)pyrrolidine-2,5-dicarbonitrile | CHEMBL207620
Type:
Small organic molecule
Emp. Form.:
C15H22N4O
Mol. Mass.:
274.3614
SMILES:
CC1CCC(C)(C1)NCC(=O)N1[C@@H](CC[C@@H]1C#N)C#N
: