Target
5-hydroxytryptamine receptor 1A
Ligand
BDBM50005132
Substrate
Meas. Tech.
ChEMBL_357738 (CHEMBL870197)
Ki
13±n/a nM
Citation
 Becker, OMDhanoa, DSMarantz, YChen, DShacham, SCheruku, SHeifetz, AMohanty, PFichman, MSharadendu, ANudelman, RKauffman, MNoiman, S An integrated in silico 3D model-driven discovery of a novel, potent, and selective amidosulfonamide 5-HT1A agonist (PRX-00023) for the treatment of anxiety and depression. J Med Chem 49:3116-35 (2006)  
Target
Name:
5-hydroxytryptamine receptor 1A
Synonyms:
5-HT-1A 5-hydroxytryptamine receptor 1A (5-HT-1A) ADRB2RL1 Dopamine D2 receptor and serotonin 1a receptor HTR1A | Serotonin receptor 1A
Type:
Mol. Mass.:
46122.49
Organism:
Homo sapiens (Human)
Description:
Residue:
422
  
Inhibitor
Name:
BDBM50005132
Synonyms:
4,4-Dimethyl-1-[4-(4-pyrimidin-2-yl-piperazin-1-yl)-butyl]-piperidine-2,6-dione CHEMBL1204187 GEPIRONE | gepiron ER
Type:
Small organic molecule
Emp. Form.:
C19H29N5O2
Mol. Mass.:
359.4659
SMILES:
CC1(C)CC(=O)N(CCCCN2CCN(CC2)c2ncccn2)C(=O)C1
: