Target
5-hydroxytryptamine receptor 1A
Ligand
BDBM50187390
Substrate
Meas. Tech.
ChEMBL_357738 (CHEMBL870197)
Ki
92±n/a nM
Citation
 Becker, OMDhanoa, DSMarantz, YChen, DShacham, SCheruku, SHeifetz, AMohanty, PFichman, MSharadendu, ANudelman, RKauffman, MNoiman, S An integrated in silico 3D model-driven discovery of a novel, potent, and selective amidosulfonamide 5-HT1A agonist (PRX-00023) for the treatment of anxiety and depression. J Med Chem 49:3116-35 (2006)  
Target
Name:
5-hydroxytryptamine receptor 1A
Synonyms:
5-HT-1A 5-hydroxytryptamine receptor 1A (5-HT-1A) ADRB2RL1 Dopamine D2 receptor and serotonin 1a receptor HTR1A | Serotonin receptor 1A
Type:
Mol. Mass.:
46122.49
Organism:
Homo sapiens (Human)
Description:
Residue:
422
  
Inhibitor
Name:
BDBM50187390
Synonyms:
CHEMBL380369 | Sunepitron
Type:
Small organic molecule
Emp. Form.:
C17H23N5O2
Mol. Mass.:
329.3968
SMILES:
[H][C@@]12CC[C@H](CN3C(=O)CCC3=O)CN1CCN(C2)c1ncccn1
: