Target
Metabotropic glutamate receptor 5
Ligand
BDBM50187639
Substrate
Meas. Tech.
ChEMBL_361060 (CHEMBL859182)
EC50
54±n/a nM
Citation
 de Paulis, THemstapat, KChen, YZhang, YSaleh, SAlagille, DBaldwin, RMTamagnan, GDConn, PJ Substituent effects of N-(1,3-diphenyl-1H-pyrazol-5-yl)benzamides on positive allosteric modulation of the metabotropic glutamate-5 receptor in rat cortical astrocytes. J Med Chem 49:3332-44 (2006)  
Target
Name:
Metabotropic glutamate receptor 5
Synonyms:
GRM5_RAT Grm5 Mglur5 metabotropic glutamate 5/1-C metabotropic glutamate 5a
Type:
Enzyme
Mol. Mass.:
131900.14
Organism:
Rattus norvegicus (Rat)
Description:
P31424
Residue:
1203
  
Inhibitor
Name:
BDBM50187639
Synonyms:
4-methoxy-N-(1,3-diphenyl-1H-pyrazol-5-yl)benzamide | CHEMBL209015
Type:
Small organic molecule
Emp. Form.:
C23H19N3O2
Mol. Mass.:
369.4159
SMILES:
COc1ccc(cc1)C(=O)Nc1cc(nn1-c1ccccc1)-c1ccccc1
: