Target
Sodium-dependent noradrenaline transporter
Ligand
BDBM50187673
Substrate
Meas. Tech.
ChEMBL_361253 (CHEMBL853283)
Ki
5090±n/a nM
Citation
 Li, HAnderes, KLKraynov, EALuthin, DRDo, QQHong, YTompkins, ESun, ETRajapakse, RPathak, VPChristie, LCFeng, JVazir, HCastillo, RGregory, MLCastro, MNared-Hood, KPaderes, GAnderson, MB Discovery of a novel, orally active, small molecule gonadotropin-releasing hormone (GnRH) receptor antagonist. J Med Chem 49:3362-7 (2006)  
Target
Name:
Sodium-dependent noradrenaline transporter
Synonyms:
Monoamine transporter NET Noradrenaline Transporter (NET) Norepinephrine transporter protein (NET) SLC6A2 Sodium-dependent noradrenaline transporter (NET) | Solute carrier family 6 member 2
Type:
Multi-pass membrane protein
Mol. Mass.:
69337.72
Organism:
Homo sapiens (Human)
Description:
P23975
Residue:
617
  
Inhibitor
Name:
BDBM50187673
Synonyms:
5-(3,3,6-trimethyl-indan-5-yloxy)-furan-2-carboxylic Acid [4,6-dimethoxy-2-(3-morpholin-4-yl-propylamino)-pyrimidine-5-yl]-amide | CHEMBL210514
Type:
Small organic molecule
Emp. Form.:
C30H39N5O6
Mol. Mass.:
565.6606
SMILES:
COc1nc(NCCCN2CCOCC2)nc(OC)c1NC(=O)c1ccc(Oc2cc3c(CCC3(C)C)cc2C)o1
: