Target
Dimer of Type-1 angiotensin II receptor
Ligand
BDBM50187673
Substrate
Meas. Tech.
ChEMBL_361254 (CHEMBL853284)
Ki
3710±n/a nM
Citation
 Li, HAnderes, KLKraynov, EALuthin, DRDo, QQHong, YTompkins, ESun, ETRajapakse, RPathak, VPChristie, LCFeng, JVazir, HCastillo, RGregory, MLCastro, MNared-Hood, KPaderes, GAnderson, MB Discovery of a novel, orally active, small molecule gonadotropin-releasing hormone (GnRH) receptor antagonist. J Med Chem 49:3362-7 (2006)  
Target
Name:
Dimer of Type-1 angiotensin II receptor
Synonyms:
Angiotensin II type 1a (AT-1a)/1b (AT-1b) receptor
Type:
Mol. Mass.:
Description:
ASSAY_ID of EBI is 361254
Components:
This complex has 2 components.
Component 1
Name:
Type-1 angiotensin II receptor
Synonyms:
AGTR1 AGTR1B AT1 AT1BR AT2R1B Angiotensin II receptor Type-1 angiotensin II receptor (AT1)
Type:
Protein
Mol. Mass.:
41080.75
Organism:
Homo sapiens (Human)
Description:
P30556
Residue:
359
  
Component 2
Name:
Type-1 angiotensin II receptor
Synonyms:
AGTR1 AGTR1B AT1 AT1BR AT2R1B Angiotensin II receptor Type-1 angiotensin II receptor (AT1)
Type:
Protein
Mol. Mass.:
41080.75
Organism:
Homo sapiens (Human)
Description:
P30556
Residue:
359
  
Inhibitor
Name:
BDBM50187673
Synonyms:
5-(3,3,6-trimethyl-indan-5-yloxy)-furan-2-carboxylic Acid [4,6-dimethoxy-2-(3-morpholin-4-yl-propylamino)-pyrimidine-5-yl]-amide | CHEMBL210514
Type:
Small organic molecule
Emp. Form.:
C30H39N5O6
Mol. Mass.:
565.6606
SMILES:
COc1nc(NCCCN2CCOCC2)nc(OC)c1NC(=O)c1ccc(Oc2cc3c(CCC3(C)C)cc2C)o1
: