Target
Tryptase
Ligand
BDBM50187800
Substrate
Meas. Tech.
ChEMBL_385584 (CHEMBL869805)
Ki
5.5±n/a nM
Citation
 Sperandio, DTai, VWLohman, JHirschbein, BMendonca, RLee, CSSpencer, JRJanc, JNguyen, MBeltman, JSprengeler, PScheerens, HLin, TLiu, LGadre, AKellogg, AGreen, MJMcGrath, ME Novel, potent, selective, and orally bioavailable human betaII-tryptase inhibitors. Bioorg Med Chem Lett 16:4085-9 (2006)  
Target
Name:
Tryptase
Synonyms:
Mcp7 TRYB1_RAT Tpsb1 | Tryptase alpha/beta-1
Type:
PROTEIN
Mol. Mass.:
30399.92
Organism:
Rattus norvegicus
Description:
ChEMBL_385584
Residue:
273
  
Inhibitor
Name:
BDBM50187800
Synonyms:
(S)-ethyl 1-(5-(4-phenethoxybenzyl)-1,2,4-oxadiazol-3-yl)-6-amino-1-oxohexan-2-ylcarbamate | CHEMBL211561
Type:
Small organic molecule
Emp. Form.:
C26H32N4O5
Mol. Mass.:
480.5561
SMILES:
CCOC(=O)N[C@@H](CCCCN)C(=O)c1noc(Cc2ccc(OCCc3ccccc3)cc2)n1
: