Target
Vitamin K-dependent protein C
Ligand
BDBM50187800
Substrate
Meas. Tech.
ChEMBL_385590 (CHEMBL869123)
Ki
>150000±n/a nM
Citation
 Sperandio, DTai, VWLohman, JHirschbein, BMendonca, RLee, CSSpencer, JRJanc, JNguyen, MBeltman, JSprengeler, PScheerens, HLin, TLiu, LGadre, AKellogg, AGreen, MJMcGrath, ME Novel, potent, selective, and orally bioavailable human betaII-tryptase inhibitors. Bioorg Med Chem Lett 16:4085-9 (2006)  
Target
Name:
Vitamin K-dependent protein C
Synonyms:
Activated protein C cofactor Apolipoprotein H Blood coagulation factor XIV Coagulation factor V heavy chain Endothelial protein C receptor PROC_HUMAN Vitamin K-dependent protein C precursor
Type:
Enzyme
Mol. Mass.:
52067.73
Organism:
Homo sapiens (Human)
Description:
Residue:
461
  
Inhibitor
Name:
BDBM50187800
Synonyms:
(S)-ethyl 1-(5-(4-phenethoxybenzyl)-1,2,4-oxadiazol-3-yl)-6-amino-1-oxohexan-2-ylcarbamate | CHEMBL211561
Type:
Small organic molecule
Emp. Form.:
C26H32N4O5
Mol. Mass.:
480.5561
SMILES:
CCOC(=O)N[C@@H](CCCCN)C(=O)c1noc(Cc2ccc(OCCc3ccccc3)cc2)n1
: