Target
Bifunctional dihydrofolate reductase-thymidylate synthase
Ligand
BDBM50188083
Substrate
Meas. Tech.
ChEMBL_379666 (CHEMBL866099)
IC50
340000±n/a nM
Citation
 Popov, VMChan, DCFillingham, YAAtom Yee, WWright, DLAnderson, AC Analysis of complexes of inhibitors with Cryptosporidium hominis DHFR leads to a new trimethoprim derivative. Bioorg Med Chem Lett 16:4366-70 (2006)  
Target
Name:
Bifunctional dihydrofolate reductase-thymidylate synthase
Synonyms:
ChDHFR-TS | Dihydrofolate Reductase (DHFR)
Type:
Enzyme
Mol. Mass.:
60186.98
Organism:
Cryptosporidium hominis
Description:
ChDHFR-TS was expressed in E. coli and purified using a methotrexate agarose column.
Residue:
521
  
Inhibitor
Name:
BDBM50188083
Synonyms:
5-(1-(3,4,5-trimethoxyphenyl)ethyl)pyrimidine-2,4-diamine CHEMBL141781
Type:
Small organic molecule
Emp. Form.:
C15H20N4O3
Mol. Mass.:
304.3443
SMILES:
COc1cc(cc(OC)c1OC)C(C)c1cnc(N)nc1N
: