Target
Fibroblast growth factor receptor 1/2/3/4
Ligand
BDBM50188266
Substrate
Meas. Tech.
ChEMBL_380312 (CHEMBL863745)
IC50
>50000±n/a nM
Citation
 Dinges, JAkritopoulou-Zanze, IArnold, LDBarlozzari, TBousquet, PFCunha, GAEricsson, AMIwasaki, NMichaelides, MROgawa, NPhelan, KMRafferty, PSowin, TJStewart, KDTokuyama, RXia, ZZhang, HQ Hit-to-lead optimization of 1,4-dihydroindeno[1,2-c]pyrazoles as a novel class of KDR kinase inhibitors. Bioorg Med Chem Lett 16:4371-5 (2006)  
Target
Name:
Fibroblast growth factor receptor 1/2/3/4
Synonyms:
Fibroblast growth factor receptor
Type:
Mol. Mass.:
Description:
ASSAY_ID of ChEMBL is 2101620
Components:
This complex has 4 components.
Component 1
Name:
Fibroblast growth factor receptor 3
Synonyms:
CD_antigen: CD333 FGFR3 Fibroblast growth factor receptor JTK4
Type:
Protein
Mol. Mass.:
87699.57
Organism:
Homo sapiens (Human)
Description:
P22607
Residue:
806
  
Component 2
Name:
Fibroblast growth factor receptor 1
Synonyms:
BFGFR Basic fibroblast growth factor receptor 1 (FGFR1) CEK FGFR-1 FGFR-1, (FL) FGFR1_HUMAN FLT2 Fibroblast growth factor receptor 1 (FGFR-1) Fms-like tyrosine kinase 2 N-sam bFGF-R | c-fgr
Type:
Receptor
Mol. Mass.:
91861.70
Organism:
Homo sapiens (Human)
Description:
P11362
Residue:
822
  
Component 3
Name:
Fibroblast growth factor receptor 4
Synonyms:
CD_antigen: CD334 FGFR4 FGFR4 Fibroblast growth factor receptor JK2 TKF
Type:
Protein
Mol. Mass.:
87957.45
Organism:
Homo sapiens (Human)
Description:
P22455
Residue:
802
  
Component 4
Name:
Fibroblast growth factor receptor 2
Synonyms:
BEK FGFR-2 FGFR2 Fibroblast growth factor receptor 2 (FGFR2) KGFR Keratinocyte growth factor receptor VEGF-receptor 2 and Fibroblast growth factor receptor 2
Type:
Enzyme
Mol. Mass.:
92015.45
Organism:
Homo sapiens (Human)
Description:
P21802
Residue:
821
  
Inhibitor
Name:
BDBM50188266
Synonyms:
7-((4-methylpiperazin-1-yl)methyl)-3-(thiophen-3-yl)-1,4-dihydroindeno[1,2-c]pyrazole | CHEMBL213743
Type:
Small organic molecule
Emp. Form.:
C20H22N4S
Mol. Mass.:
350.48
SMILES:
CN1CCN(Cc2ccc3Cc4c(n[nH]c4-c4ccsc4)-c3c2)CC1
: