Target
Epidermal growth factor receptor
Ligand
BDBM50188272
Substrate
Meas. Tech.
ChEMBL_380313 (CHEMBL863746)
IC50
>50000±n/a nM
Citation
 Dinges, JAkritopoulou-Zanze, IArnold, LDBarlozzari, TBousquet, PFCunha, GAEricsson, AMIwasaki, NMichaelides, MROgawa, NPhelan, KMRafferty, PSowin, TJStewart, KDTokuyama, RXia, ZZhang, HQ Hit-to-lead optimization of 1,4-dihydroindeno[1,2-c]pyrazoles as a novel class of KDR kinase inhibitors. Bioorg Med Chem Lett 16:4371-5 (2006)  
Target
Name:
Epidermal growth factor receptor
Synonyms:
EGF Receptor Substrate EGFR_HUMAN ERBB1 Epidermal Growth Factor Receptor erbB-1 Epidermal growth factor receptor (EGFR) HER1 Proto-oncogene c-ErbB-1 Tyrosine-Protein Kinase ErbB-1
Type:
Receptor Kinase Domain
Mol. Mass.:
134279.59
Organism:
Homo sapiens (Human)
Description:
P00533
Residue:
1210
  
Inhibitor
Name:
BDBM50188272
Synonyms:
7-((1H-imidazol-1-yl)methyl)-3-(thiophen-3-yl)-1,4-dihydroindeno[1,2-c]pyrazole | CHEMBL212084
Type:
Small organic molecule
Emp. Form.:
C18H14N4S
Mol. Mass.:
318.396
SMILES:
C(c1ccc2Cc3c(n[nH]c3-c3ccsc3)-c2c1)n1ccnc1
: