Target
Replicase polyprotein 1a
Ligand
BDBM50133617
Substrate
Meas. Tech.
ChEMBL_362485 (CHEMBL868157)
Ki
50100±n/a nM
Citation
 Zhou, LLiu, YZhang, WWei, PHuang, CPei, JYuan, YLai, L Isatin compounds as noncovalent SARS coronavirus 3C-like protease inhibitors. J Med Chem 49:3440-3 (2006)  
Target
Name:
Replicase polyprotein 1a
Synonyms:
3C-like proteinase 3CLp Growth factor-like peptide Non-structural protein 1 Non-structural protein 11 Non-structural protein 3 Non-structural protein 6 Non-structural protein 8 ORF1a polyprotein PL2-PRO Papain-like proteinase Replicase polyprotein 1a SARS coronavirus 3C-like proteinase nsp1 nsp11 nsp3 nsp5 nsp7 nsp9 pp1a
Type:
Enzyme
Mol. Mass.:
486353.36
Organism:
Human SARS coronavirus (SARS-CoV)
Description:
P0C6U8
Residue:
4382
  
Inhibitor
Name:
BDBM50133617
Synonyms:
1-Benzyl-5-iodo-1H-indole-2,3-dione CHEMBL118596 | acs.jmedchem.1c00409_ST.706
Type:
Small organic molecule
Emp. Form.:
C15H10INO2
Mol. Mass.:
363.1499
SMILES:
Ic1ccc2N(Cc3ccccc3)C(=O)C(=O)c2c1
: