Target
Melatonin receptor type 1B
Ligand
BDBM50188400
Substrate
Meas. Tech.
ChEMBL_362910 (CHEMBL866345)
Ki
3.3±n/a nM
Citation
 Tsotinis, AVlachou, MPapahatjis, DPCalogeropoulou, TNikas, SPGarratt, PJPiccio, VVonhoff, SDavidson, KTeh, MTSugden, D Mapping the melatonin receptor. 7. Subtype selective ligands based on beta-substituted N-acyl-5-methoxytryptamines and beta-substituted N-acyl-5-methoxy-1-methyltryptamines. J Med Chem 49:3509-19 (2006)  
Target
Name:
Melatonin receptor type 1B
Synonyms:
MTNR1B Mel-1B-R Melatonin 1B Melatonin receptor type 1B | Melatonin receptor type 2 (MT2)
Type:
Enzyme
Mol. Mass.:
40203.54
Organism:
Homo sapiens (Human)
Description:
P49286
Residue:
362
  
Inhibitor
Name:
BDBM50188400
Synonyms:
CHEMBL207960 | N-(2-[5-methoxy-1H-indol-3-yl]-2,2-trimethyleneethyl)acetamide
Type:
Small organic molecule
Emp. Form.:
C16H20N2O2
Mol. Mass.:
272.3422
SMILES:
COc1ccc2[nH]cc(c2c1)C1(CNC(C)=O)CCC1
: