Target
Melatonin receptor type 1A
Ligand
BDBM50188398
Substrate
Meas. Tech.
ChEMBL_362909 (CHEMBL866344)
Ki
>10000±n/a nM
Citation
 Tsotinis, AVlachou, MPapahatjis, DPCalogeropoulou, TNikas, SPGarratt, PJPiccio, VVonhoff, SDavidson, KTeh, MTSugden, D Mapping the melatonin receptor. 7. Subtype selective ligands based on beta-substituted N-acyl-5-methoxytryptamines and beta-substituted N-acyl-5-methoxy-1-methyltryptamines. J Med Chem 49:3509-19 (2006)  
Target
Name:
Melatonin receptor type 1A
Synonyms:
MTNR1A MTR1A_HUMAN Mel1a melatonin receptor Melatonin receptor Melatonin receptor type 1 (MT1) | Melatonin receptor type 1A
Type:
Enzyme
Mol. Mass.:
39392.94
Organism:
Homo sapiens (Human)
Description:
P48039
Residue:
350
  
Inhibitor
Name:
BDBM50188398
Synonyms:
CHEMBL206686 | N-(2-[1-methyl-1H-indol-3-yl]-2,2-trimethylene-ethyl)cyclobutanecarboxamide
Type:
Small organic molecule
Emp. Form.:
C19H24N2O2
Mol. Mass.:
312.4061
SMILES:
Cn1cc(c2cc(O)ccc12)C1(CNC(=O)C2CCC2)CCC1
: