Target
Melatonin receptor type 1A
Ligand
BDBM50188403
Substrate
Meas. Tech.
ChEMBL_362909 (CHEMBL866344)
Ki
170±n/a nM
Citation
 Tsotinis, AVlachou, MPapahatjis, DPCalogeropoulou, TNikas, SPGarratt, PJPiccio, VVonhoff, SDavidson, KTeh, MTSugden, D Mapping the melatonin receptor. 7. Subtype selective ligands based on beta-substituted N-acyl-5-methoxytryptamines and beta-substituted N-acyl-5-methoxy-1-methyltryptamines. J Med Chem 49:3509-19 (2006)  
Target
Name:
Melatonin receptor type 1A
Synonyms:
MTNR1A MTR1A_HUMAN Mel1a melatonin receptor Melatonin receptor Melatonin receptor type 1 (MT1) | Melatonin receptor type 1A
Type:
Enzyme
Mol. Mass.:
39392.94
Organism:
Homo sapiens (Human)
Description:
P48039
Residue:
350
  
Inhibitor
Name:
BDBM50188403
Synonyms:
CHEMBL382439 | N-(2-(5-methoxy-1-methyl-1H-indol-3-yl)-2-methylpropyl)cyN-(2-(5-Methoxy-1-methyl-1H-indol-3-yl)-2-methylpropyl)cyclobutanecarboxamide
Type:
Small organic molecule
Emp. Form.:
C19H26N2O2
Mol. Mass.:
314.4219
SMILES:
COc1ccc2n(C)cc(c2c1)C(C)(C)CNC(=O)C1CCC1
: