Target
Protein kinase C alpha type
Ligand
BDBM2579
Substrate
Meas. Tech.
ChEMBL_389606 (CHEMBL868613)
IC50
1±n/a nM
Citation
 Lin, XMurray, JMRico, ACWang, MXChu, DTZhou, YDel Rosario, MKaufman, SMa, SFang, ECrawford, KJefferson, AB Discovery of 2-pyrimidyl-5-amidothiophenes as potent inhibitors for AKT: synthesis and SAR studies. Bioorg Med Chem Lett 16:4163-8 (2006)  
Target
Name:
Protein kinase C alpha type
Synonyms:
KPCA_HUMAN PKC alpha and beta-2 PKC-alpha PRKACA Protein Kinase C- alpha Protein kinase C alpha (PKCa) Protein kinase C alpha type (PRKCA) RAF proto-oncogene serine/threonine-protein kinase
Type:
Enzyme
Mol. Mass.:
76755.65
Organism:
Homo sapiens (Human)
Description:
The recombinant human PKC enzymes were produced using a baculovirus expression system in SF9 cells
Residue:
672
  
Inhibitor
Name:
BDBM2579
Synonyms:
(2S,3R,4R,6R)-3-methoxy-2-methyl-4-(methylamino)-29-oxa-1,7,17-triazaoctacyclo[12.12.2.1^{2,6}.0^{7,28}.0^{8,13}.0^{15,19}.0^{20,27}.0^{21,26}]nonacosa-8(13),9,11,14(28),15(19),20(27),21(26),22,24-nonaen-16-one Staurosporin, 4 Staurosporine, 8 US9206188, Staurosporine | US9226923, Staurosporine
Type:
Small organic molecule
Emp. Form.:
C28H26N4O3
Mol. Mass.:
466.531
SMILES:
CN[C@@H]1C[C@H]2O[C@@](C)([C@@H]1OC)n1c3ccccc3c3c4CNC(=O)c4c4c5ccccc5n2c4c13
: