Target
RAC-gamma serine/threonine-protein kinase
Ligand
BDBM50188939
Substrate
Meas. Tech.
ChEMBL_389599 (CHEMBL868042)
IC50
2100±n/a nM
Citation
 Lin, XMurray, JMRico, ACWang, MXChu, DTZhou, YDel Rosario, MKaufman, SMa, SFang, ECrawford, KJefferson, AB Discovery of 2-pyrimidyl-5-amidothiophenes as potent inhibitors for AKT: synthesis and SAR studies. Bioorg Med Chem Lett 16:4163-8 (2006)  
Target
Name:
RAC-gamma serine/threonine-protein kinase
Synonyms:
AKT3 PKB gamma Protein kinase Akt-3 Protein kinase B, gamma RAC-gamma serine/threonine-protein kinase Serine/threonine-protein kinase AKT | Serine/threonine-protein kinase AKT3
Type:
Enzyme
Mol. Mass.:
55769.36
Organism:
Homo sapiens (Human)
Description:
Residue:
479
  
Inhibitor
Name:
BDBM50188939
Synonyms:
1-(2,4-dichlorobenzyl)-3-(5-(2-(methylamino)pyrimidin-4-yl)thiophen-2-yl)urea | CHEMBL376424
Type:
Small organic molecule
Emp. Form.:
C17H15Cl2N5OS
Mol. Mass.:
408.305
SMILES:
CNc1nccc(n1)-c1ccc(NC(=O)NCc2ccc(Cl)cc2Cl)s1
: