Target
Cruzipain
Ligand
BDBM50189280
Substrate
Meas. Tech.
ChEMBL_381155 (CHEMBL867357)
IC50
80±n/a nM
Citation
 Siles, RChen, SEZhou, MPinney, KGTrawick, ML Design, synthesis, and biochemical evaluation of novel cruzain inhibitors with potential application in the treatment of Chagas' disease. Bioorg Med Chem Lett 16:4405-9 (2006)  
Target
Name:
Cruzipain
Synonyms:
CYSP_TRYCR Cruzaine | Major cysteine proteinase
Type:
Protein
Mol. Mass.:
49831.41
Organism:
Trypanosoma cruzi
Description:
P25779
Residue:
467
  
Inhibitor
Name:
BDBM50189280
Synonyms:
1-((3-bromophenyl)(phenyl)methylene)thiosemicarbazide | CHEMBL376207
Type:
Small organic molecule
Emp. Form.:
C14H12BrN3S
Mol. Mass.:
334.234
SMILES:
NC(=S)NN=C(c1ccccc1)c1cccc(Br)c1
: