Target
Sodium-dependent dopamine transporter
Ligand
BDBM50189573
Substrate
Meas. Tech.
ChEMBL_395402 (CHEMBL908067)
Ki
8.48±n/a nM
Citation
 Zeng, FJarkas, NOwens, MJKilts, CDNemeroff, CBGoodman, MM Synthesis and monoamine transporter affinity of front bridged tricyclic 3beta-(4'-halo or 4'-methyl)phenyltropanes bearing methylene or carbomethoxymethylene on the bridge to the 2beta-position. Bioorg Med Chem Lett 16:4661-3 (2006)  
Target
Name:
Sodium-dependent dopamine transporter
Synonyms:
DA transporter DAT1 Dopamine transporter protein (DAT) SC6A3_HUMAN Sodium-dependent dopamine transporter Solute carrier family 6 member 3
Type:
Multi-pass membrane protein
Mol. Mass.:
68497.11
Organism:
Homo sapiens (Human)
Description:
Q01959
Residue:
620
  
Inhibitor
Name:
BDBM50189573
Synonyms:
3-(4-iodo-phenyl)-5-methylene-7-aza-tricyclo[5.3.0.0*4,8*]decane | CHEMBL380383
Type:
Small organic molecule
Emp. Form.:
C16H18IN
Mol. Mass.:
351.2253
SMILES:
Ic1ccc(cc1)C1CC2CCC3C1C(=C)CN23
: