Target
Adenosine receptor A1
Ligand
BDBM50189809
Substrate
Meas. Tech.
ChEMBL_367224 (CHEMBL864123)
Ki
1±n/a nM
Citation
 Lenzi, OColotta, VCatarzi, DVarano, FFilacchioni, GMartini, CTrincavelli, LCiampi, OVarani, KMarighetti, FMorizzo, EMoro, S 4-amido-2-aryl-1,2,4-triazolo[4,3-a]quinoxalin-1-ones as new potent and selective human A3 adenosine receptor antagonists. synthesis, pharmacological evaluation, and ligand-receptor modeling studies. J Med Chem 49:3916-25 (2006)  
Target
Name:
Adenosine receptor A1
Synonyms:
AA1R_BOVIN ADENOSINE A1 high ADORA1 | Adenosine A1 receptor
Type:
Enzyme Catalytic Domain
Mol. Mass.:
36602.99
Organism:
BOVINE
Description:
ADENOSINE 0 BOVINE::P28190
Residue:
326
  
Inhibitor
Name:
BDBM50189809
Synonyms:
CHEMBL378514 | N-(6-amino-1-oxo-2-phenyl-1,2-dihydro-[1,2,4]triazolo[4,3-a]quinoxalin-4-yl)acetamide
Type:
Small organic molecule
Emp. Form.:
C17H14N6O2
Mol. Mass.:
334.3321
SMILES:
CC(=O)Nc1nc2c(N)cccc2n2c1nn(-c1ccccc1)c2=O
: