Target
Calpain-1 catalytic subunit
Ligand
BDBM50189828
Substrate
Meas. Tech.
ChEMBL_367107 (CHEMBL863671)
IC50
86±n/a nM
Citation
 Shirasaki, YNakamura, MYamaguchi, MMiyashita, HSakai, OInoue, J Exploration of orally available calpain inhibitors 2: peptidyl hemiacetal derivatives. J Med Chem 49:3926-32 (2006)  
Target
Name:
Calpain-1 catalytic subunit
Synonyms:
CAN1_HUMAN CAPN1 Calpain-1 (u-Calpain) Calpain1
Type:
Protein
Mol. Mass.:
81880.51
Organism:
Homo sapiens (Human)
Description:
Residue:
714
  
Inhibitor
Name:
BDBM50189828
Synonyms:
1-((S)-1-((3S)-2-hydroxy-tetrahydrofuran-3-ylamino)-4-methyl-1-oxopentan-2-yl)-3-phenylthiourea SNJ-1715
Type:
Small organic molecule
Emp. Form.:
C17H25N3O3S
Mol. Mass.:
351.464
SMILES:
CC(C)C[C@H](NC(=S)Nc1ccccc1)C(=O)N[C@H]1CCOC1O
: