Target
Calpain-2 catalytic subunit
Ligand
BDBM50189831
Substrate
Meas. Tech.
ChEMBL_367108 (CHEMBL863672)
IC50
340±n/a nM
Citation
 Shirasaki, YNakamura, MYamaguchi, MMiyashita, HSakai, OInoue, J Exploration of orally available calpain inhibitors 2: peptidyl hemiacetal derivatives. J Med Chem 49:3926-32 (2006)  
Target
Name:
Calpain-2 catalytic subunit
Synonyms:
3.4.22.53 CANP 2 Calcium-activated neutral proteinase 2 Calpain M-type Calpain-2 large subunit Millimolar-calpain
Type:
Mol. Mass.:
37789.71
Organism:
Sus scrofa
Description:
Residue:
324
  
Inhibitor
Name:
BDBM50189831
Synonyms:
(2S)-4-methyl-2-((((3-methylphenyl)amino)thioxomethyl)-amino)-N-((3S)-tetrahydro-2-hydroxy-3-furanyl)pentanamide | CHEMBL261953
Type:
Small organic molecule
Emp. Form.:
C18H27N3O3S
Mol. Mass.:
365.49
SMILES:
CC(C)C[C@H](NC(=S)Nc1cccc(C)c1)C(=O)N[C@H]1CCOC1O
: