Target
Calpain-1 catalytic subunit
Ligand
BDBM50189834
Substrate
Meas. Tech.
ChEMBL_367107 (CHEMBL863671)
IC50
260±n/a nM
Citation
 Shirasaki, YNakamura, MYamaguchi, MMiyashita, HSakai, OInoue, J Exploration of orally available calpain inhibitors 2: peptidyl hemiacetal derivatives. J Med Chem 49:3926-32 (2006)  
Target
Name:
Calpain-1 catalytic subunit
Synonyms:
CAN1_HUMAN CAPN1 Calpain-1 (u-Calpain) Calpain1
Type:
Protein
Mol. Mass.:
81880.51
Organism:
Homo sapiens (Human)
Description:
Residue:
714
  
Inhibitor
Name:
BDBM50189834
Synonyms:
(2S)-2-((((3-cyanophenyl)amino)thioxomethyl)amino)-4-methyl-N-((3S)-tetrahydro-2-hydroxy-3-furanyl)pentanamide | CHEMBL209274
Type:
Small organic molecule
Emp. Form.:
C18H24N4O3S
Mol. Mass.:
376.473
SMILES:
CC(C)C[C@H](NC(=S)Nc1cccc(c1)C#N)C(=O)N[C@H]1CCOC1O
: