Target
Calpain-1 catalytic subunit
Ligand
BDBM50114340
Substrate
Meas. Tech.
ChEMBL_367107 (CHEMBL863671)
IC50
22±n/a nM
Citation
 Shirasaki, YNakamura, MYamaguchi, MMiyashita, HSakai, OInoue, J Exploration of orally available calpain inhibitors 2: peptidyl hemiacetal derivatives. J Med Chem 49:3926-32 (2006)  
Target
Name:
Calpain-1 catalytic subunit
Synonyms:
CAN1_HUMAN CAPN1 Calpain-1 (u-Calpain) Calpain1
Type:
Protein
Mol. Mass.:
81880.51
Organism:
Homo sapiens (Human)
Description:
Residue:
714
  
Inhibitor
Name:
BDBM50114340
Synonyms:
(S)-2-(4-Fluoro-benzenesulfonylamino)-N-((S)-1-formyl-3-methyl-butyl)-3-methyl-butyramide CHEMBL288365 SJA-6017
Type:
Small organic molecule
Emp. Form.:
C17H25FN2O4S
Mol. Mass.:
372.455
SMILES:
CC(C)C[C@H](NC(=O)[C@@H](NS(=O)(=O)c1ccc(F)cc1)C(C)C)C=O
: