Target
Melanin-concentrating hormone receptor 1
Ligand
BDBM50190270
Substrate
Meas. Tech.
ChEMBL_405654 (CHEMBL869867)
Ki
29±n/a nM
Citation
 Rowbottom, MWVickers, TDDyck, BGrey, JTamiya, JZhang, MKiankarimi, MWu, DDwight, WWade, WSSchwarz, DHeise, CEMadan, AFisher, APetroski, RGoodfellow, VS Synthesis and structure-activity relationships of retro bis-aminopyrrolidine urea (rAPU) derived small-molecule antagonists of the melanin-concentrating hormone receptor-1 (MCH-R1). Part 1. Bioorg Med Chem Lett 16:4450-7 (2006)  
Target
Name:
Melanin-concentrating hormone receptor 1
Synonyms:
G-protein coupled receptor 24 MCH receptor 1 MCH-R1 MCHR-1 MCHR1_HUMAN Melanin-Concentrating Hormone Receptor 1 (MCH1R) Melanin-concentrating hormone receptor 1 (MCH-1) Melanin-concentrating hormone receptor 1 (MCHR-1) SLC-1 Somatostatin receptor-like protein
Type:
G Protein-Coupled Receptor (GPCR)
Mol. Mass.:
45976.27
Organism:
Homo sapiens (Human)
Description:
Membranes from CHO-K1 cells stably expressing human MCH1R were used in assays.
Residue:
422
  
Inhibitor
Name:
BDBM50190270
Synonyms:
4'-trifluoromethyl-biphenyl-4-carboxylic acid methyl-((S)-1-{(R)-3-[methyl-(4-methyl-cyclohexyl)-amino]-pyrrolidine-1-carbonyl}-pyrrolidin-3-yl)-amide | CHEMBL385959
Type:
Small organic molecule
Emp. Form.:
C32H41F3N4O2
Mol. Mass.:
570.6887
SMILES:
CC1CCC(CC1)N(C)[C@@H]1CCN(C1)C(=O)N1CC[C@@H](C1)N(C)C(=O)c1ccc(cc1)-c1ccc(cc1)C(F)(F)F
: