Target
Adenosine receptor A3
Ligand
BDBM50190433
Substrate
Meas. Tech.
ChEMBL_375257 (CHEMBL867484)
Ki
14±n/a nM
Citation
 Tafi, ABernardini, CBotta, MCorelli, FAndreini, MMartinelli, AOrtore, GBaraldi, PGFruttarolo, FBorea, PATuccinardi, T Pharmacophore based receptor modeling: the case of adenosine A3 receptor antagonists. An approach to the optimization of protein models. J Med Chem 49:4085-97 (2006)  
Target
Name:
Adenosine receptor A3
Synonyms:
A3 adenosine receptor (hA3) ADORA3 | Adenosine A3 receptor (A3AR)
Type:
G Protein-Coupled Receptor (GPCR)
Mol. Mass.:
36197.32
Organism:
Homo sapiens (Human)
Description:
P0DMS8
Residue:
318
  
Inhibitor
Name:
BDBM50190433
Synonyms:
5-[[(4-pyridyl)amino]carbonyl]amino-[8-(3-benzyloxypropyl)-2-(furan-2-yl)-8H-pyrazolo[4,3-e][1,2,4]triazolo[1,5-c]pyrimidine | CHEMBL208686
Type:
Small organic molecule
Emp. Form.:
C26H23N9O3
Mol. Mass.:
509.5193
SMILES:
O=C(Nc1ccncc1)Nc1nc2nn(CCCOCc3ccccc3)cc2c2nc(nn12)-c1ccco1
: